Target
Bifunctional epoxide hydrolase 2
Ligand
BDBM50191867
Substrate
Meas. Tech.
ChEMBL_393605 (CHEMBL912696)
IC50
1.2±n/a nM
Citation
 Jones, PDTsai, HJDo, ZNMorisseau, CHammock, BD Synthesis and SAR of conformationally restricted inhibitors of soluble epoxide hydrolase. Bioorg Med Chem Lett 16:5212-6 (2006)  
Target
Name:
Bifunctional epoxide hydrolase 2
Synonyms:
Cytosolic epoxide hydrolase 2 EPHX2 HYES_HUMAN Soluble epoxide hydrolase (sEH) | epoxide hydrolase 2, cytoplasmic
Type:
Enzyme
Mol. Mass.:
62613.07
Organism:
Homo sapiens (Human)
Description:
P34913
Residue:
555
  
Inhibitor
Name:
BDBM50191867
Synonyms:
1-adamantan-1-yl-3-[1-(pyridine-2-carbonyl)-piperidin-4-yl]-urea | CHEMBL215161
Type:
Small organic molecule
Emp. Form.:
C22H30N4O2
Mol. Mass.:
382.4992
SMILES:
O=C(NC1CCN(CC1)C(=O)c1ccccn1)NC12CC3CC(CC(C3)C1)C2
: