Target
Bifunctional epoxide hydrolase 2
Ligand
BDBM50191882
Substrate
Meas. Tech.
ChEMBL_393605 (CHEMBL912696)
IC50
1.1±n/a nM
Citation
 Jones, PDTsai, HJDo, ZNMorisseau, CHammock, BD Synthesis and SAR of conformationally restricted inhibitors of soluble epoxide hydrolase. Bioorg Med Chem Lett 16:5212-6 (2006)  
Target
Name:
Bifunctional epoxide hydrolase 2
Synonyms:
Cytosolic epoxide hydrolase 2 EPHX2 HYES_HUMAN Soluble epoxide hydrolase (sEH) | epoxide hydrolase 2, cytoplasmic
Type:
Enzyme
Mol. Mass.:
62613.07
Organism:
Homo sapiens (Human)
Description:
P34913
Residue:
555
  
Inhibitor
Name:
BDBM50191882
Synonyms:
4-[4-(3-adamantan-1-yl-ureido)-piperidine-1-carbonyl]-benzoic acid methyl ester | CHEMBL215999
Type:
Small organic molecule
Emp. Form.:
C25H33N3O4
Mol. Mass.:
439.5472
SMILES:
COC(=O)c1ccc(cc1)C(=O)N1CCC(CC1)NC(=O)NC12CC3CC(CC(C3)C1)C2
: