Target
Glutamate receptor 4
Ligand
BDBM50191947
Substrate
Meas. Tech.
ChEMBL_393592 (CHEMBL856923)
EC50
>3000±n/a nM
Citation
 Zarrinmayeh, HTromiczak, EZimmerman, DMRankl, NHo, KHDominguez, ECastaño, AEscribano, AFernandez, CJimenez, AHornback, WJNisenbaum, ES A novel class of positive allosteric modulators of AMPA receptors: design, synthesis, and structure-activity relationships of 3-biphenyl-4-yl-4-cyano-5-ethyl-1-methyl-1H-pyrrole-2-carboxylic acid, LY2059346. Bioorg Med Chem Lett 16:5203-6 (2006)  
Target
Name:
Glutamate receptor 4
Synonyms:
GLUR4 GRIA4_HUMAN Glutamate receptor ionotropic AMPA | Glutamate receptor ionotropic, AMPA 4
Type:
PROTEIN
Mol. Mass.:
100881.87
Organism:
Homo sapiens (Human)
Description:
ChEMBL_468628
Residue:
902
  
Inhibitor
Name:
BDBM50191947
Synonyms:
4-cyano-5-ethyl-1-methyl-3-(4'-methyl-biphenyl-4-yl)-1H-pyrrole-2-carboxylic acid | CHEMBL214844
Type:
Small organic molecule
Emp. Form.:
C22H20N2O2
Mol. Mass.:
344.4064
SMILES:
CCc1c(C#N)c(c(C(O)=O)n1C)-c1ccc(cc1)-c1ccc(C)cc1
: