Target
Synaptic vesicular amine transporter
Ligand
BDBM50080826
Substrate
Meas. Tech.
ChEMBL_404073 (CHEMBL909739)
Ki
6440±n/a nM
Citation
 Zheng, GHorton, DBDeaciuc, AGDwoskin, LPCrooks, PA Des-keto lobeline analogs with increased potency and selectivity at dopamine and serotonin transporters. Bioorg Med Chem Lett 16:5018-21 (2006)  
Target
Name:
Synaptic vesicular amine transporter
Synonyms:
Monoamine transporter Solute carrier family 18 member 2 Synaptic vesicular amine transporter VMAT2_RAT Vesicular monoamine transporter 2 (VMAT2) | Vmat2
Type:
Protein
Mol. Mass.:
55689.58
Organism:
Rattus norvegicus (Rat)
Description:
Q01827
Residue:
515
  
Inhibitor
Name:
BDBM50080826
Synonyms:
(S)-2-[(2S,6R)-1-Methyl-6-((E)-styryl)-piperidin-2-yl]-1-phenyl-ethanol CHEMBL124219
Type:
Small organic molecule
Emp. Form.:
C22H27NO
Mol. Mass.:
321.4559
SMILES:
CN1[C@H](C[C@H](O)c2ccccc2)CCC[C@@H]1\C=C\c1ccccc1
: