Target
Sodium-dependent serotonin transporter
Ligand
BDBM50193219
Substrate
Meas. Tech.
ChEMBL_392659 (CHEMBL864283)
Ki
90.8±n/a nM
Citation
 Bois, FBaldwin, RMKula, NSBaldessarini, RJAl Tikriti, MInnis, RBTamagnan, GD Synthesis and monoamine transporter affinity of 2beta-carbomethoxy-3beta-(4'-p-substituted phenyl)-piperidine analogs of cocaine. Bioorg Med Chem Lett 16:5222-5 (2006)  
Target
Name:
Sodium-dependent serotonin transporter
Synonyms:
5-HT Transporter 5HT transporter Anandamid membrane transporter, AMT Monoamine transporters; Norepinephrine & serotonin Slc6a4 Sodium-dependent serotonin transporter (SERT) | imipramine receptor
Type:
Multi-pass membrane protein
Mol. Mass.:
70168.43
Organism:
Rattus norvegicus (rat)
Description:
P31652
Residue:
630
  
Inhibitor
Name:
BDBM50193219
Synonyms:
(3S,4S)-methyl 1-methyl-4-(4-(thiophen-2-yl)phenyl)piperidine-3-carboxylate | CHEMBL214618
Type:
Small organic molecule
Emp. Form.:
C18H21NO2S
Mol. Mass.:
315.43
SMILES:
COC(=O)[C@@H]1CN(C)CC[C@@H]1c1ccc(cc1)-c1cccs1
: