Target
Sodium-dependent dopamine transporter
Ligand
BDBM50193221
Substrate
Meas. Tech.
ChEMBL_392660 (CHEMBL863115)
Ki
123±n/a nM
Citation
 Bois, FBaldwin, RMKula, NSBaldessarini, RJAl Tikriti, MInnis, RBTamagnan, GD Synthesis and monoamine transporter affinity of 2beta-carbomethoxy-3beta-(4'-p-substituted phenyl)-piperidine analogs of cocaine. Bioorg Med Chem Lett 16:5222-5 (2006)  
Target
Name:
Sodium-dependent dopamine transporter
Synonyms:
DA transporter SC6A3_RAT Sodium-dependent dopamine transporter | Sodium-dependent dopamine transporter (DAT)
Type:
Multi-pass membrane protein
Mol. Mass.:
68749.45
Organism:
Rattus norvegicus (rat)
Description:
P23977
Residue:
619
  
Inhibitor
Name:
BDBM50193221
Synonyms:
(3S,4S)-methyl 4-(4-(2-iodovinyl)phenyl)-1-methylpiperidine-3-carboxylate | CHEMBL213921
Type:
Small organic molecule
Emp. Form.:
C16H20INO2
Mol. Mass.:
385.24
SMILES:
COC(=O)[C@@H]1CN(C)CC[C@@H]1c1ccc(\C=C/I)cc1
: