Target
Lysophosphatidic acid receptor 3
Ligand
BDBM50193516
Substrate
Meas. Tech.
ChEMBL_385203 (CHEMBL868015)
EC50
>7030±n/a nM
Citation
 Xu, YJiang, GTsukahara, RFujiwara, YTigyi, GPrestwich, GD Phosphonothioate and fluoromethylene phosphonate analogues of cyclic phosphatidic acid: Novel antagonists of lysophosphatidic acid receptors. J Med Chem 49:5309-15 (2006)  
Target
Name:
Lysophosphatidic acid receptor 3
Synonyms:
EDG7 LPAR3 Lysophosphatidic acid receptor 1/3 Lysophosphatidic acid receptor Edg-7
Type:
Enzyme
Mol. Mass.:
40149.72
Organism:
Homo sapiens (Human)
Description:
Q9UBY5
Residue:
353
  
Inhibitor
Name:
BDBM50193516
Synonyms:
1,1-difluoro-3(S)-hydroxyl-4-oleoyloxylbutane 1,3-cyclic phosphonate | CHEMBL215722
Type:
Small organic molecule
Emp. Form.:
C22H41F2O5P
Mol. Mass.:
454.5285
SMILES:
CCCCCCCCCCCCCCCCCC(=O)OC[C@@H]1CC(F)(F)P(O)(=O)O1
: