Target
Peroxisome proliferator-activated receptor gamma
Ligand
BDBM50193727
Substrate
Meas. Tech.
ChEMBL_424080 (CHEMBL855083)
IC50
290±n/a nM
Citation
 Hopkins, CRO'neil, SVLaufersweiler, MCWang, YPokross, MMekel, MEvdokimov, AWalter, RKontoyianni, MPetrey, MESabatakos, GRoesgen, JTRichardson, EDemuth, TP Design and synthesis of novel N-sulfonyl-2-indole carboxamides as potent PPAR-gamma binding agents with potential application to the treatment of osteoporosis. Bioorg Med Chem Lett 16:5659-63 (2006)  
Target
Name:
Peroxisome proliferator-activated receptor gamma
Synonyms:
NR1C3 PPAR-gamma PPARG_HUMAN Peroxisome proliferator-activated receptor gamma (PPAR gamma) Peroxisome proliferator-activated receptor gamma (PPARĪ³) peroxisome proliferator-activated receptor gamma isoform 2
Type:
Nuclear Receptor
Mol. Mass.:
57613.46
Organism:
Homo sapiens (Human)
Description:
P37231
Residue:
505
  
Inhibitor
Name:
BDBM50193727
Synonyms:
1-(3-(trifluoromethyl)benzyl)-N-tosyl-1H-indole-2-carboxamide | CHEMBL220475
Type:
Small organic molecule
Emp. Form.:
C24H19F3N2O3S
Mol. Mass.:
472.479
SMILES:
Cc1ccc(cc1)S(=O)(=O)NC(=O)c1cc2ccccc2n1Cc1cccc(c1)C(F)(F)F
: