Target
Sodium-dependent dopamine transporter
Ligand
BDBM50193765
Substrate
Meas. Tech.
ChEMBL_424086 (CHEMBL855089)
Ki
157±n/a nM
Citation
 Watson, PSJiang, BHarrison, KAsakawa, NWelch, PKCovington, MStowell, NCWadman, EADavies, PSolomon, KANewton, RCTrainor, GLFriedman, SMDecicco, CPKo, SS 2,4-Disubstituted piperidines as selective CC chemokine receptor 3 (CCR3) antagonists: synthesis and selectivity. Bioorg Med Chem Lett 16:5695-9 (2006)  
Target
Name:
Sodium-dependent dopamine transporter
Synonyms:
DA transporter DAT1 Dopamine transporter protein (DAT) SC6A3_HUMAN Sodium-dependent dopamine transporter Solute carrier family 6 member 3
Type:
Multi-pass membrane protein
Mol. Mass.:
68497.11
Organism:
Homo sapiens (Human)
Description:
Q01959
Residue:
620
  
Inhibitor
Name:
BDBM50193765
Synonyms:
1-(3-((2S,4R)-4-(4-fluorobenzyl)-1-propylpiperidin-2-yl)propyl)-3-(3,5-diacetylphenyl)urea | CHEMBL386073
Type:
Small organic molecule
Emp. Form.:
C29H38FN3O3
Mol. Mass.:
495.6287
SMILES:
CCCN1CC[C@@H](Cc2ccc(F)cc2)C[C@@H]1CCCNC(=O)Nc1cc(cc(c1)C(C)=O)C(C)=O
: