Target
Sodium-dependent noradrenaline transporter
Ligand
BDBM50193768
Substrate
Meas. Tech.
ChEMBL_424087 (CHEMBL855090)
Ki
39±n/a nM
Citation
 Watson, PSJiang, BHarrison, KAsakawa, NWelch, PKCovington, MStowell, NCWadman, EADavies, PSolomon, KANewton, RCTrainor, GLFriedman, SMDecicco, CPKo, SS 2,4-Disubstituted piperidines as selective CC chemokine receptor 3 (CCR3) antagonists: synthesis and selectivity. Bioorg Med Chem Lett 16:5695-9 (2006)  
Target
Name:
Sodium-dependent noradrenaline transporter
Synonyms:
Monoamine transporter NET Noradrenaline Transporter (NET) Norepinephrine transporter protein (NET) SLC6A2 Sodium-dependent noradrenaline transporter (NET) | Solute carrier family 6 member 2
Type:
Multi-pass membrane protein
Mol. Mass.:
69337.72
Organism:
Homo sapiens (Human)
Description:
P23975
Residue:
617
  
Inhibitor
Name:
BDBM50193768
Synonyms:
(+/-)1-(3-acetylphenyl)-3-(3-((2S,4R)-4-benzylpiperidin-2-yl)propyl)urea | CHEMBL218581
Type:
Small organic molecule
Emp. Form.:
C24H31N3O2
Mol. Mass.:
393.5218
SMILES:
CC(=O)c1cccc(NC(=O)NCCC[C@H]2C[C@H](Cc3ccccc3)CCN2)c1
: