Target
Sodium-dependent serotonin transporter
Ligand
BDBM50193771
Substrate
Meas. Tech.
ChEMBL_424085 (CHEMBL855088)
Ki
217±n/a nM
Citation
 Watson, PSJiang, BHarrison, KAsakawa, NWelch, PKCovington, MStowell, NCWadman, EADavies, PSolomon, KANewton, RCTrainor, GLFriedman, SMDecicco, CPKo, SS 2,4-Disubstituted piperidines as selective CC chemokine receptor 3 (CCR3) antagonists: synthesis and selectivity. Bioorg Med Chem Lett 16:5695-9 (2006)  
Target
Name:
Sodium-dependent serotonin transporter
Synonyms:
5-HT Transporter 5HTT SC6A4_HUMAN SLC6A4 Serotonin transporter (5HTT) Sodium-dependent serotonin transporter (SERT) | Solute carrier family 6 member 4
Type:
Multi-pass membrane protein
Mol. Mass.:
70322.51
Organism:
Homo sapiens (Human)
Description:
P31645
Residue:
630
  
Inhibitor
Name:
BDBM50193771
Synonyms:
1-(3-((2S,4R)-4-(4-fluorobenzyl)-1-allylpiperidin-2-yl)propyl)-3-(3-acetylphenyl)urea | CHEMBL221903
Type:
Small organic molecule
Emp. Form.:
C27H34FN3O2
Mol. Mass.:
451.5762
SMILES:
CC(=O)c1cccc(NC(=O)NCCC[C@H]2C[C@H](Cc3ccc(F)cc3)CCN2CC=C)c1
: