Target
Sodium-dependent noradrenaline transporter
Ligand
BDBM50193774
Substrate
Meas. Tech.
ChEMBL_424087 (CHEMBL855090)
Ki
95±n/a nM
Citation
 Watson, PSJiang, BHarrison, KAsakawa, NWelch, PKCovington, MStowell, NCWadman, EADavies, PSolomon, KANewton, RCTrainor, GLFriedman, SMDecicco, CPKo, SS 2,4-Disubstituted piperidines as selective CC chemokine receptor 3 (CCR3) antagonists: synthesis and selectivity. Bioorg Med Chem Lett 16:5695-9 (2006)  
Target
Name:
Sodium-dependent noradrenaline transporter
Synonyms:
Monoamine transporter NET Noradrenaline Transporter (NET) Norepinephrine transporter protein (NET) SLC6A2 Sodium-dependent noradrenaline transporter (NET) | Solute carrier family 6 member 2
Type:
Multi-pass membrane protein
Mol. Mass.:
69337.72
Organism:
Homo sapiens (Human)
Description:
P23975
Residue:
617
  
Inhibitor
Name:
BDBM50193774
Synonyms:
(+)1-(3-((2S,4R)-4-(4-fluorobenzyl)piperidin-2-yl)propyl)-3-(3,5-diacetylphenyl)urea | CHEMBL217987
Type:
Small organic molecule
Emp. Form.:
C26H32FN3O3
Mol. Mass.:
453.549
SMILES:
CC(=O)c1cc(NC(=O)NCCC[C@H]2C[C@H](Cc3ccc(F)cc3)CCN2)cc(c1)C(C)=O
: