Target
Sodium-dependent dopamine transporter
Ligand
BDBM50193762
Substrate
Meas. Tech.
ChEMBL_424086 (CHEMBL855089)
Ki
34.0±n/a nM
Citation
 Watson, PSJiang, BHarrison, KAsakawa, NWelch, PKCovington, MStowell, NCWadman, EADavies, PSolomon, KANewton, RCTrainor, GLFriedman, SMDecicco, CPKo, SS 2,4-Disubstituted piperidines as selective CC chemokine receptor 3 (CCR3) antagonists: synthesis and selectivity. Bioorg Med Chem Lett 16:5695-9 (2006)  
Target
Name:
Sodium-dependent dopamine transporter
Synonyms:
DA transporter DAT1 Dopamine transporter protein (DAT) SC6A3_HUMAN Sodium-dependent dopamine transporter Solute carrier family 6 member 3
Type:
Multi-pass membrane protein
Mol. Mass.:
68497.11
Organism:
Homo sapiens (Human)
Description:
Q01959
Residue:
620
  
Inhibitor
Name:
BDBM50193762
Synonyms:
(+)1-(3-((2S,4R)-4-benzylpiperidin-2-yl)propyl)-3-(3-cyanophenyl)urea (-)1-(3-((2S,4R)-4-benzylpiperidin-2-yl)propyl)-3-(3-cyanophenyl)urea | CHEMBL218997
Type:
Small organic molecule
Emp. Form.:
C23H28N4O
Mol. Mass.:
376.4946
SMILES:
O=C(NCCC[C@H]1C[C@H](Cc2ccccc2)CCN1)Nc1cccc(c1)C#N
: