Target
Sodium-dependent serotonin transporter
Ligand
BDBM50193775
Substrate
Meas. Tech.
ChEMBL_424085 (CHEMBL855088)
Ki
212±n/a nM
Citation
 Watson, PSJiang, BHarrison, KAsakawa, NWelch, PKCovington, MStowell, NCWadman, EADavies, PSolomon, KANewton, RCTrainor, GLFriedman, SMDecicco, CPKo, SS 2,4-Disubstituted piperidines as selective CC chemokine receptor 3 (CCR3) antagonists: synthesis and selectivity. Bioorg Med Chem Lett 16:5695-9 (2006)  
Target
Name:
Sodium-dependent serotonin transporter
Synonyms:
5-HT Transporter 5HTT SC6A4_HUMAN SLC6A4 Serotonin transporter (5HTT) Sodium-dependent serotonin transporter (SERT) | Solute carrier family 6 member 4
Type:
Multi-pass membrane protein
Mol. Mass.:
70322.51
Organism:
Homo sapiens (Human)
Description:
P31645
Residue:
630
  
Inhibitor
Name:
BDBM50193775
Synonyms:
1-(3-((2S,4R)-4-(4-fluorobenzyl)-1-(3-hydroxypropyl)piperidin-2-yl)propyl)-3-(3,5-diacetylphenyl)urea | CHEMBL384199
Type:
Small organic molecule
Emp. Form.:
C29H38FN3O4
Mol. Mass.:
511.6281
SMILES:
CC(=O)c1cc(NC(=O)NCCC[C@H]2C[C@H](Cc3ccc(F)cc3)CCN2CCCO)cc(c1)C(C)=O
: