Target
Sodium-dependent dopamine transporter
Ligand
BDBM50193777
Substrate
Meas. Tech.
ChEMBL_424086 (CHEMBL855089)
Ki
251±n/a nM
Citation
 Watson, PSJiang, BHarrison, KAsakawa, NWelch, PKCovington, MStowell, NCWadman, EADavies, PSolomon, KANewton, RCTrainor, GLFriedman, SMDecicco, CPKo, SS 2,4-Disubstituted piperidines as selective CC chemokine receptor 3 (CCR3) antagonists: synthesis and selectivity. Bioorg Med Chem Lett 16:5695-9 (2006)  
Target
Name:
Sodium-dependent dopamine transporter
Synonyms:
DA transporter DAT1 Dopamine transporter protein (DAT) SC6A3_HUMAN Sodium-dependent dopamine transporter Solute carrier family 6 member 3
Type:
Multi-pass membrane protein
Mol. Mass.:
68497.11
Organism:
Homo sapiens (Human)
Description:
Q01959
Residue:
620
  
Inhibitor
Name:
BDBM50193777
Synonyms:
1-(3-((2S,4R)-4-(4-fluorobenzyl)-1-(cyclopropylmethyl)piperidin-2-yl)propyl)-3-(3-acetylphenyl)urea | CHEMBL220819
Type:
Small organic molecule
Emp. Form.:
C28H36FN3O2
Mol. Mass.:
465.6027
SMILES:
CC(=O)c1cccc(NC(=O)NCCC[C@H]2C[C@H](Cc3ccc(F)cc3)CCN2CC2CC2)c1
: