Target
Sodium-dependent dopamine transporter
Ligand
BDBM50193764
Substrate
Meas. Tech.
ChEMBL_424086 (CHEMBL855089)
Ki
31±n/a nM
Citation
 Watson, PSJiang, BHarrison, KAsakawa, NWelch, PKCovington, MStowell, NCWadman, EADavies, PSolomon, KANewton, RCTrainor, GLFriedman, SMDecicco, CPKo, SS 2,4-Disubstituted piperidines as selective CC chemokine receptor 3 (CCR3) antagonists: synthesis and selectivity. Bioorg Med Chem Lett 16:5695-9 (2006)  
Target
Name:
Sodium-dependent dopamine transporter
Synonyms:
DA transporter DAT1 Dopamine transporter protein (DAT) SC6A3_HUMAN Sodium-dependent dopamine transporter Solute carrier family 6 member 3
Type:
Multi-pass membrane protein
Mol. Mass.:
68497.11
Organism:
Homo sapiens (Human)
Description:
Q01959
Residue:
620
  
Inhibitor
Name:
BDBM50193764
Synonyms:
(2S,4R)-2-{3-[3-(3,5-diacetyl-phenyl)-ureido]-propyl}-4-(4-fluoro-benzyl)-piperidine-1-carboxamidine | CHEMBL220766
Type:
Small organic molecule
Emp. Form.:
C27H34FN5O3
Mol. Mass.:
495.589
SMILES:
CC(=O)c1cc(NC(=O)NCCC[C@H]2C[C@H](Cc3ccc(F)cc3)CCN2C(N)=N)cc(c1)C(C)=O
: