Target
Histamine H1 receptor
Ligand
BDBM50194205
Substrate
Meas. Tech.
ChEMBL_393878 (CHEMBL854648)
EC50
>10000±n/a nM
Citation
 Watanabe, MKazuta, YHayashi, HYamada, SMatsuda, AShuto, S Stereochemical diversity-oriented conformational restriction strategy. Development of potent histamine H3 and/or H4 receptor antagonists with an imidazolylcyclopropane structure. J Med Chem 49:5587-96 (2006)  
Target
Name:
Histamine H1 receptor
Synonyms:
H1R HISTAMINE H1 HRH1_HUMAN
Type:
G Protein-Coupled Receptor (GPCR)
Mol. Mass.:
55808.72
Organism:
Homo sapiens (Human)
Description:
Cell pellets from SK-N-MC cells transfected with human H1 receptor were used in binding assay.
Residue:
487
  
Inhibitor
Name:
BDBM50194205
Synonyms:
(1R,2S)-trans-2-[2-(4-chlorobenzylamino)ethyl]-1-(1H-imidazol-4-yl)cyclopropane | CHEMBL213886
Type:
Small organic molecule
Emp. Form.:
C15H18ClN3
Mol. Mass.:
275.777
SMILES:
Clc1ccc(CNCC[C@@H]2C[C@H]2c2cnc[nH]2)cc1
: