Target
Tyrosine-protein kinase JAK3
Ligand
BDBM50194682
Substrate
Meas. Tech.
ChEMBL_396626 (CHEMBL853499)
IC50
>25000±n/a nM
Citation
 DiMauro, EFNewcomb, JNunes, JJBemis, JEBoucher, CBuchanan, JLBuckner, WHCee, VJChai, LDeak, HLEpstein, LFFaust, TGallant, PGeuns-Meyer, SDGore, AGu, YHenkle, BHodous, BLHsieh, FHuang, XKim, JLLee, JHMartin, MWMasse, CEMcGowan, DCMetz, DMohn, DMorgenstern, KAOliveira-dos-Santos, APatel, VFPowers, DRose, PESchneider, STomlinson, SATudor, YYTurci, SMWelcher, AAWhite, RDZhao, HZhu, LZhu, X Discovery of aminoquinazolines as potent, orally bioavailable inhibitors of Lck: synthesis, SAR, and in vivo anti-inflammatory activity. J Med Chem 49:5671-86 (2006)  
Target
Name:
Tyrosine-protein kinase JAK3
Synonyms:
JAK-3 JAK3_HUMAN Janus kinase 3 (JAK3) L-JAK | Leukocyte janus kinase
Type:
Protein
Mol. Mass.:
125111.08
Organism:
Homo sapiens (Human)
Description:
P52333
Residue:
1124
  
Inhibitor
Name:
BDBM50194682
Synonyms:
CHEMBL213478 | N-methyl-6-(2-methyl-5-(5-(trifluoromethyl)-1Hbenzo[d]imidazol-2-ylamino)phenyl)quinazolin-2-amine
Type:
Small organic molecule
Emp. Form.:
C24H19F3N6
Mol. Mass.:
448.4431
SMILES:
CNc1ncc2cc(ccc2n1)-c1cc(Nc2nc3ccc(cc3[nH]2)C(F)(F)F)ccc1C
: