Target
Acetyl-CoA carboxylase 2
Ligand
BDBM50195048
Substrate
Meas. Tech.
ChEMBL_424667 (CHEMBL855117)
IC50
67±n/a nM
Citation
 Clark, RFZhang, TXin, ZLiu, GWang, YHansen, TMWang, XWang, RZhang, XFrevert, EUCamp, HSBeutel, BASham, HLGu, YG Structure-activity relationships for a novel series of thiazolyl phenyl ether derivatives exhibiting potent and selective acetyl-CoA carboxylase 2 inhibitory activity. Bioorg Med Chem Lett 16:6078-81 (2006)  
Target
Name:
Acetyl-CoA carboxylase 2
Synonyms:
ACACB ACC-beta ACCB Acetyl-CoA carboxylase 2 Acetyl-CoA carboxylase 2 (ACC2)
Type:
Protein
Mol. Mass.:
276535.21
Organism:
Homo sapiens (Human)
Description:
O00763
Residue:
2458
  
Inhibitor
Name:
BDBM50195048
Synonyms:
CHEMBL219665 | N-(4-(2-(4-((tetrahydrofuran-3-yl)methoxy)phenoxy)thiazol-5-yl)but-3-yn-2-yl)acetamide
Type:
Small organic molecule
Emp. Form.:
C20H22N2O4S
Mol. Mass.:
386.465
SMILES:
CC(NC(C)=O)C#Cc1cnc(Oc2ccc(OCC3CCOC3)cc2)s1
: