Target
11-beta-hydroxysteroid dehydrogenase type 2
Ligand
BDBM50195298
Substrate
Meas. Tech.
ChEMBL_424848 (CHEMBL907398)
IC50
>10000±n/a nM
Citation
 Sorensen, BRohde, JWang, JFung, SMonzon, KChiou, WPan, LDeng, XStolarik, DFrevert, EUJacobson, PLink, JT Adamantane 11-beta-HSD-1 inhibitors: Application of an isocyanide multicomponent reaction. Bioorg Med Chem Lett 16:5958-62 (2006)  
Target
Name:
11-beta-hydroxysteroid dehydrogenase type 2
Synonyms:
11-DH2 11-beta-Hydroxysteroid Dehydrogenase 2 (11-beta-HSD2) 11-beta-hydroxysteroid dehydrogenase 2 11-beta-hydroxysteroid dehydrogenase type 2 (11-beta-HSD2) DHI2_HUMAN HSD11K SDR9C3
Type:
Enzyme
Mol. Mass.:
44141.72
Organism:
Homo sapiens (Human)
Description:
Purified recombinant human 11beta-HSD2.
Residue:
405
  
Inhibitor
Name:
BDBM50195298
Synonyms:
4-[2-(3,3-difluoro-piperidin-1-yl)-butyrylamino]-adamantane-1-carboxylic acid amide | CHEMBL222319
Type:
Small organic molecule
Emp. Form.:
C20H31F2N3O2
Mol. Mass.:
383.4758
SMILES:
CCC(N1CCCC(F)(F)C1)C(=O)N[C@H]1C2CC3CC1C[C@](C3)(C2)C(N)=O
: