Target
Stromelysin-1
Ligand
BDBM50198035
Substrate
Meas. Tech.
ChEMBL_432504 (CHEMBL918798)
IC50
230±n/a nM
Citation
 Biasone, ATortorella, PCampestre, CAgamennone, MPreziuso, SChiappini, MNuti, ECarelli, PRossello, AMazza, FGallina, C alpha-Biphenylsulfonylamino 2-methylpropyl phosphonates: enantioselective synthesis and selective inhibition of MMPs. Bioorg Med Chem 15:791-9 (2006)  
Target
Name:
Stromelysin-1
Synonyms:
MMP-3 MMP3_HUMAN Matrix metalloproteinase 3 Matrix metalloproteinase-3 (MMP-3) SL-1 Stromelysin 1 | Transin-1
Type:
Enzyme
Mol. Mass.:
53973.13
Organism:
Homo sapiens (Human)
Description:
P08254
Residue:
477
  
Inhibitor
Name:
BDBM50198035
Synonyms:
CHEMBL227501 | [(R)-2-methyl-1-(3'-methyl-biphenyl-4-sulfonylamino)-propyl]-phosphonic acid
Type:
Small organic molecule
Emp. Form.:
C17H22NO5PS
Mol. Mass.:
383.399
SMILES:
CC(C)[C@H](NS(=O)(=O)c1ccc(cc1)-c1cccc(C)c1)P(O)(O)=O
: