Target
Transporter
Ligand
BDBM50198229
Substrate
Meas. Tech.
ChEMBL_453325 (CHEMBL901477)
Ki
101±n/a nM
Citation
 Tamagnan, GDBrenner, EAlagille, DStaley, JKHaile, CKoren, AEarly, MBaldwin, RMTarazi, FIBaldessarini, RJJarkas, NGoodman, MMSeibyl, JP Development of SPECT imaging agents for the norepinephrine transporters: [123I]INER. Bioorg Med Chem Lett 17:533-7 (2007)  
Target
Name:
Transporter
Synonyms:
Monoamine transporters; Norepininephrine & dopamine | Norepinephrine Monoamine transporters
Type:
PROTEIN
Mol. Mass.:
66787.87
Organism:
Rattus norvegicus
Description:
ChEMBL_1463061
Residue:
597
  
Inhibitor
Name:
BDBM50198229
Synonyms:
2-((3-iodophenyl)(2-(trifluoromethyl)phenoxy)methyl)morpholine | CHEMBL429658
Type:
Small organic molecule
Emp. Form.:
C18H17F3INO2
Mol. Mass.:
463.2328
SMILES:
FC(F)(F)c1ccccc1OC(C1CNCCO1)c1cccc(I)c1
: