Target
Transporter
Ligand
BDBM50198231
Substrate
Meas. Tech.
ChEMBL_453325 (CHEMBL901477)
Ki
70.4±n/a nM
Citation
 Tamagnan, GDBrenner, EAlagille, DStaley, JKHaile, CKoren, AEarly, MBaldwin, RMTarazi, FIBaldessarini, RJJarkas, NGoodman, MMSeibyl, JP Development of SPECT imaging agents for the norepinephrine transporters: [123I]INER. Bioorg Med Chem Lett 17:533-7 (2007)  
Target
Name:
Transporter
Synonyms:
Monoamine transporters; Norepininephrine & dopamine | Norepinephrine Monoamine transporters
Type:
PROTEIN
Mol. Mass.:
66787.87
Organism:
Rattus norvegicus
Description:
ChEMBL_1463061
Residue:
597
  
Inhibitor
Name:
BDBM50198231
Synonyms:
2-((2-nitrobenzyloxy)(3-iodophenyl)methyl)morpholine | CHEMBL247284
Type:
Small organic molecule
Emp. Form.:
C18H19IN2O4
Mol. Mass.:
454.2589
SMILES:
[O-][N+](=O)c1ccccc1COC(C1CNCCO1)c1cccc(I)c1
: