Target
Transporter
Ligand
BDBM50198234
Substrate
Meas. Tech.
ChEMBL_453325 (CHEMBL901477)
Ki
71.9±n/a nM
Citation
 Tamagnan, GDBrenner, EAlagille, DStaley, JKHaile, CKoren, AEarly, MBaldwin, RMTarazi, FIBaldessarini, RJJarkas, NGoodman, MMSeibyl, JP Development of SPECT imaging agents for the norepinephrine transporters: [123I]INER. Bioorg Med Chem Lett 17:533-7 (2007)  
Target
Name:
Transporter
Synonyms:
Monoamine transporters; Norepininephrine & dopamine | Norepinephrine Monoamine transporters
Type:
PROTEIN
Mol. Mass.:
66787.87
Organism:
Rattus norvegicus
Description:
ChEMBL_1463061
Residue:
597
  
Inhibitor
Name:
BDBM50198234
Synonyms:
2-((5-iodothiophen-2-yl)(o-tolyloxy)methyl)morpholine | CHEMBL245638
Type:
Small organic molecule
Emp. Form.:
C16H18INO2S
Mol. Mass.:
415.289
SMILES:
Cc1ccccc1OC(C1CNCCO1)c1ccc(I)s1
: