Target
Transporter
Ligand
BDBM50198227
Substrate
Meas. Tech.
ChEMBL_453325 (CHEMBL901477)
Ki
28.5±n/a nM
Citation
 Tamagnan, GDBrenner, EAlagille, DStaley, JKHaile, CKoren, AEarly, MBaldwin, RMTarazi, FIBaldessarini, RJJarkas, NGoodman, MMSeibyl, JP Development of SPECT imaging agents for the norepinephrine transporters: [123I]INER. Bioorg Med Chem Lett 17:533-7 (2007)  
Target
Name:
Transporter
Synonyms:
Monoamine transporters; Norepininephrine & dopamine | Norepinephrine Monoamine transporters
Type:
PROTEIN
Mol. Mass.:
66787.87
Organism:
Rattus norvegicus
Description:
ChEMBL_1463061
Residue:
597
  
Inhibitor
Name:
BDBM50198227
Synonyms:
2-((2-ethoxyphenoxy)(3-iodophenyl)methyl)morpholine | CHEMBL394965
Type:
Small organic molecule
Emp. Form.:
C19H22INO3
Mol. Mass.:
439.2874
SMILES:
CCOc1ccccc1OC(C1CNCCO1)c1cccc(I)c1
: