Target
Melanin-concentrating hormone receptor 1
Ligand
BDBM50198502
Substrate
Meas. Tech.
ChEMBL_421812 (CHEMBL854912)
Ki
12±n/a nM
Citation
 Meyers, KMKim, NMéndez-Andino, JLHu, XEMumin, RNKlopfenstein, SRWos, JAMitchell, MCParis, JLAckley, DCHolbert, JKMittelstadt, SWReizes, O Aminomethyl tetrahydronaphthalene biphenyl carboxamide MCH-R1 antagonists--Increasing selectivity over hERG. Bioorg Med Chem Lett 17:814-8 (2007)  
Target
Name:
Melanin-concentrating hormone receptor 1
Synonyms:
G-protein coupled receptor 24 MCH receptor 1 MCH-R1 MCHR-1 MCHR1_HUMAN Melanin-Concentrating Hormone Receptor 1 (MCH1R) Melanin-concentrating hormone receptor 1 (MCH-1) Melanin-concentrating hormone receptor 1 (MCHR-1) SLC-1 Somatostatin receptor-like protein
Type:
G Protein-Coupled Receptor (GPCR)
Mol. Mass.:
45976.27
Organism:
Homo sapiens (Human)
Description:
Membranes from CHO-K1 cells stably expressing human MCH1R were used in assays.
Residue:
422
  
Inhibitor
Name:
BDBM50198502
Synonyms:
(S)-6-(4-chlorophenyl)-N-(6-((dimethylamino)methyl)-1,2,3,4-tetrahydronaphthalen-2-yl)-N-methylnicotinamide | CHEMBL217820
Type:
Small organic molecule
Emp. Form.:
C26H28ClN3O
Mol. Mass.:
433.973
SMILES:
CN(C)Cc1ccc2C[C@H](CCc2c1)N(C)C(=O)c1ccc(nc1)-c1ccc(Cl)cc1
: