Target
Potassium voltage-gated channel subfamily H member 2
Ligand
BDBM50198571
Substrate
Meas. Tech.
ChEMBL_421371 (CHEMBL854894)
IC50
4000±n/a nM
Citation
 Meyers, KMMéndez-Andino, JLColson, AOWarshakoon, NCWos, JAMitchell, MCHodge, KMHoward, JMAckley, DCHolbert, JKMittelstadt, SWDowty, MEObringer, CMReizes, OHu, XE Aminomethyl tetrahydronaphthalene ketopiperazine MCH-R1 antagonists--Increasing selectivity over hERG. Bioorg Med Chem Lett 17:819-22 (2007)  
Target
Name:
Potassium voltage-gated channel subfamily H member 2
Synonyms:
1,3-beta-glucan synthase component GLS2 ERG Eag-related protein 1 Ether-a-go-go-related gene (HERG) Ether-a-go-go-related gene potassium channel 1 Ether-a-go-go-related gene potassium channel 1 (hERG1) Ether-a-go-go-related protein 1 H-ERG KCNH2 Potassium voltage-gated channel subfamily H member 2 (hERG) Voltage-gated potassium channel subunit Kv11.1 hERG Potassium Channel 1 | putative potassium channel subunit
Type:
Multi-pass membrane protein
Mol. Mass.:
126672.65
Organism:
Homo sapiens (Human)
Description:
Q12809
Residue:
1159
  
Inhibitor
Name:
BDBM50198571
Synonyms:
(S)-1-(6-((1H-imidazol-1-yl)methyl)-1,2,3,4-tetrahydronaphthalen-2-yl)-4-(4-fluorophenethyl)piperazin-2-one | CHEMBL214983
Type:
Small organic molecule
Emp. Form.:
C26H29FN4O
Mol. Mass.:
432.5331
SMILES:
Fc1ccc(CCN2CCN([C@H]3CCc4cc(Cn5ccnc5)ccc4C3)C(=O)C2)cc1
: