Target
Adenosine receptor A2a
Ligand
BDBM50199272
Substrate
Meas. Tech.
ChEMBL_412715 (CHEMBL908374)
Ki
132±n/a nM
Citation
 Kiesman, WFZhao, JConlon, PRDowling, JEPetter, RCLutterodt, FJin, XSmits, GFure, MJayaraj, AKim, JSullivan, GLinden, J Potent and orally bioavailable 8-bicyclo[2.2.2]octylxanthines as adenosine A1 receptor antagonists. J Med Chem 49:7119-31 (2006)  
Target
Name:
Adenosine receptor A2a
Synonyms:
A2A adenosine receptor (hA2A) ADENOSINE A2 ADORA2 Adenosine A2A receptor (A2AAR)
Type:
G Protein-Coupled Receptor (GPCR)
Mol. Mass.:
44716.46
Organism:
Homo sapiens (Human)
Description:
P29274
Residue:
412
  
Inhibitor
Name:
BDBM50199272
Synonyms:
4-(2,6-dioxo-1,3-dipropyl-2,3,6,7-tetrahydro-1H-purin-8-yl)-bicyclo[2.2.2]octane-1-carboxylic Acid (2-dimethylamino-ethyl)-amide | CHEMBL217541
Type:
Small organic molecule
Emp. Form.:
C24H38N6O3
Mol. Mass.:
458.5969
SMILES:
CCCn1c2nc([nH]c2c(=O)n(CCC)c1=O)[C@@]12CC[C@@](CC1)(CC2)C(=O)NCCN(C)C
: