Target
Phenylethanolamine N-methyltransferase
Ligand
BDBM13017
Substrate
Meas. Tech.
ChEMBL_441055 (CHEMBL890212)
Ki
280±n/a nM
Citation
 Grunewald, GLSeim, MRRegier, RCCriscione, KR Exploring the active site of phenylethanolamine N-methyltransferase with 1,2,3,4-tetrahydrobenz[h]isoquinoline inhibitors. Bioorg Med Chem 15:1298-310 (2007)  
Target
Name:
Phenylethanolamine N-methyltransferase
Synonyms:
Noradrenaline N-methyltransferase PNMT PNMTase | Phenylethanolamine N-Methyltransferase (PNMT)
Type:
Enzyme
Mol. Mass.:
30852.66
Organism:
Homo sapiens (Human)
Description:
Residue:
282
  
Inhibitor
Name:
BDBM13017
Synonyms:
1,2,3,4-tetrahydroisoquinoline-7-sulfonamide SKF 29661
Type:
Small organic molecule
Emp. Form.:
C9H12N2O2S
Mol. Mass.:
212.269
SMILES:
NS(=O)(=O)c1ccc2CCNCc2c1
: