Target
NAD-dependent protein deacetylase sirtuin-1
Ligand
BDBM3175
Substrate
Meas. Tech.
ChEMBL_422397 (CHEMBL909828)
IC50
5100±n/a nM
Citation
 Trapp, JJochum, AMeier, RSaunders, LMarshall, BKunick, CVerdin, EGoekjian, PSippl, WJung, M Adenosine mimetics as inhibitors of NAD+-dependent histone deacetylases, from kinase to sirtuin inhibition. J Med Chem 49:7307-16 (2006)  
Target
Name:
NAD-dependent protein deacetylase sirtuin-1
Synonyms:
NAD-Dependent Deacetylase Sirtuin-1 NAD-dependent protein deacetylase sirtuin-1 (SIRT1) SIR2-like protein 1 SIRT1 Sirtuin-1 (SIRT1) | hSIR2
Type:
Developmental protein; hydrolase
Mol. Mass.:
81626.66
Organism:
Homo sapiens (Human)
Description:
Residue:
747
  
Inhibitor
Name:
BDBM3175
Synonyms:
3-[1-[3-(Amidinothio)propyl]-3-indolyl]-4-(1-methyl-3-indolyl)-1H-pyrrole-2,5-dione Methanesulfonate Bisindolylmaleimide 11b CHEMBL6291 Ro 31-8220 [(3-{3-[4-(1-methyl-1H-indol-3-yl)-2,5-dioxo-2,5-dihydro-1H-pyrrol-3-yl]-1H-indol-1-yl}propyl)sulfanyl]methanimidamide
Type:
Small organic molecule
Emp. Form.:
C25H23N5O2S
Mol. Mass.:
457.547
SMILES:
Cn1cc(C2=C(C(=O)NC2=O)c2cn(CCCSC(N)=N)c3ccccc23)c2ccccc12
: