Target
Melanocortin receptor 3
Ligand
BDBM50200355
Substrate
Meas. Tech.
ChEMBL_410062 (CHEMBL907163)
IC50
>1000±n/a nM
Citation
 Ying, JGu, XCai, MDedek, MVagner, JTrivedi, DBHruby, VJ Design, synthesis, and biological evaluation of new cyclic melanotropin peptide analogues selective for the human melanocortin-4 receptor. J Med Chem 49:6888-96 (2006)  
Target
Name:
Melanocortin receptor 3
Synonyms:
MC3-R MC3R_HUMAN Melanocortin receptor (M3 and M4)
Type:
Enzyme
Mol. Mass.:
36044.86
Organism:
Homo sapiens (Human)
Description:
P41968
Residue:
323
  
Inhibitor
Name:
BDBM50200355
Synonyms:
Ac-c[Glu-His-D-Phe-N-alpha-guanidinylbutyl-Dab]-Trp-NH2 | CHEMBL214477
Type:
Small organic molecule
Emp. Form.:
C42H55N13O7
Mol. Mass.:
853.969
SMILES:
CC(=O)N[C@H]1CCC(=O)NCCC(N(CCCCN=C(N)N)C(=O)[C@@H](Cc2ccccc2)NC(=O)[C@H](Cc2cnc[nH]2)NC1=O)C(=O)N[C@@H](Cc1c[nH]c2ccccc12)C(N)=O
: