Target
Nociceptin receptor
Ligand
BDBM50200603
Substrate
Meas. Tech.
ChEMBL_453754 (CHEMBL885755)
IC50
436±n/a nM
Citation
 Palin, RBom, AClark, JKEvans, LFeilden, HHoughton, AKJones, PSMontgomery, BWeston, MAWishart, G Synthesis and evaluation of N-3 substituted phenoxypropyl piperidine benzimidazol-2-one analogues as NOP receptor agonists with analgesic and sedative properties. Bioorg Med Chem 15:1828-47 (2007)  
Target
Name:
Nociceptin receptor
Synonyms:
KOR-3 Mu-type opioid receptor (Mu) Nociceptin Receptor (ORL1 Receptor) Nociceptin receptor (ORL-1) Nociceptin/Orphanin FQ, NOP receptor OPIATE ORL-1 OPRL1 protein ORL1 Opioid receptor like-1 Orphanin FQ receptor (ORL1) | P41146
Type:
G Protein-Coupled Receptor (GPCR)
Mol. Mass.:
40702.87
Organism:
Homo sapiens (Human)
Description:
P41146
Residue:
370
  
Inhibitor
Name:
BDBM50200603
Synonyms:
CHEMBL241157 | N-(2-methoxy-ethyl)-2-(3-{1-[3-(5-methoxy-2-methyl-phenoxy)-4-methyl-pentyl]-piperidin-4-yl}-2-oxo-2,3-dihydro-benzimidazol-1-yl)-acetamide
Type:
Small organic molecule
Emp. Form.:
C31H44N4O5
Mol. Mass.:
552.7049
SMILES:
COCCNC(=O)Cn1c2ccccc2n(C2CCN(CCC(Oc3cc(OC)ccc3C)C(C)C)CC2)c1=O
: