Target
Mu-type opioid receptor
Ligand
BDBM50200603
Substrate
Meas. Tech.
ChEMBL_453747 (CHEMBL885747)
Ki
180±n/a nM
Citation
 Palin, RBom, AClark, JKEvans, LFeilden, HHoughton, AKJones, PSMontgomery, BWeston, MAWishart, G Synthesis and evaluation of N-3 substituted phenoxypropyl piperidine benzimidazol-2-one analogues as NOP receptor agonists with analgesic and sedative properties. Bioorg Med Chem 15:1828-47 (2007)  
Target
Name:
Mu-type opioid receptor
Synonyms:
M-OR-1 MOR-1 MUOR1 Mu opiate receptor OPRM1 hMOP | mu-type opioid receptor isoform MOR-1
Type:
G Protein-Coupled Receptor (GPCR)
Mol. Mass.:
44789.51
Organism:
Homo sapiens (Human)
Description:
P35372
Residue:
400
  
Inhibitor
Name:
BDBM50200603
Synonyms:
CHEMBL241157 | N-(2-methoxy-ethyl)-2-(3-{1-[3-(5-methoxy-2-methyl-phenoxy)-4-methyl-pentyl]-piperidin-4-yl}-2-oxo-2,3-dihydro-benzimidazol-1-yl)-acetamide
Type:
Small organic molecule
Emp. Form.:
C31H44N4O5
Mol. Mass.:
552.7049
SMILES:
COCCNC(=O)Cn1c2ccccc2n(C2CCN(CCC(Oc3cc(OC)ccc3C)C(C)C)CC2)c1=O
: