Target
Vascular endothelial growth factor receptor 2
Ligand
BDBM50201302
Substrate
Meas. Tech.
ChEMBL_438153 (CHEMBL907546)
IC50
13±n/a nM
Citation
 Heyman, HRFrey, RRBousquet, PFCunha, GAMoskey, MDAhmed, AASoni, NBMarcotte, PAPease, LJGlaser, KBYates, MBouska, JJAlbert, DHBlack-Schaefer, CLDandliker, PJStewart, KDRafferty, PDavidsen, SKMichaelides, MRCurtin, ML Thienopyridine urea inhibitors of KDR kinase. Bioorg Med Chem Lett 17:1246-9 (2007)  
Target
Name:
Vascular endothelial growth factor receptor 2
Synonyms:
CD_antigen=CD309 Fetal liver kinase 1 (FLK-1) KDR Protein-tyrosine kinase receptor Flk-1 VEGFR-2 VEGFR2 Vascular Endothelial Growth Factor Receptor Kinase 2 Vascular endothelial growth factor receptor 2 (KDR) Vascular endothelial growth factor receptor 2 (VEGFR2) Vascular endothelial growth factor receptor-2 (VEGFR-2)
Type:
Receptor Tyrosine Kinase
Mol. Mass.:
151510.97
Organism:
Homo sapiens (Human)
Description:
P35968
Residue:
1356
  
Inhibitor
Name:
BDBM50201302
Synonyms:
1-(4-(4-amino-7-phenylthieno[3,2-c]pyridin-3-yl)phenyl)-3-m-tolylurea | CHEMBL231511
Type:
Small organic molecule
Emp. Form.:
C27H22N4OS
Mol. Mass.:
450.555
SMILES:
Cc1cccc(NC(=O)Nc2ccc(cc2)-c2csc3c(cnc(N)c23)-c2ccccc2)c1
: