Target
B1 bradykinin receptor
Ligand
BDBM50202421
Substrate
Meas. Tech.
ChEMBL_423668 (CHEMBL913433)
Ki
0.13±n/a nM
Citation
 Kuduk, SDDi Marco, CNChang, RKWood, MRSchirripa, KMKim, JJWai, JMDiPardo, RMMurphy, KLRansom, RWHarrell, CMReiss, DRHolahan, MACook, JHess, JFSain, NUrban, MOTang, CPrueksaritanont, TPettibone, DJBock, MG Development of orally bioavailable and CNS penetrant biphenylaminocyclopropane carboxamide bradykinin B1 receptor antagonists. J Med Chem 50:272-82 (2007)  
Target
Name:
B1 bradykinin receptor
Synonyms:
B1 BRADYKININ B1R BK-1 receptor BRADYB1 | Bradykinin B1 receptor
Type:
Enzyme
Mol. Mass.:
40508.87
Organism:
Homo sapiens (Human)
Description:
P46663
Residue:
353
  
Inhibitor
Name:
BDBM50202421
Synonyms:
3,3'-difluoro-4'-((R)-1-{[1-(3,3,3-trifluoro-propionylamino)-cyclopropanecarbonyl]-amino}-ethyl)-biphenyl-2-carboxylic acid methyl ester CHEMBL373530
Type:
Small organic molecule
Emp. Form.:
C23H21F5N2O4
Mol. Mass.:
484.4159
SMILES:
COC(=O)c1c(F)cccc1-c1ccc([C@@H](C)NC(=O)C2(CC2)NC(=O)CC(F)(F)F)c(F)c1
: