Target
Malonyl-CoA decarboxylase, mitochondrial
Ligand
BDBM50202793
Substrate
Meas. Tech.
ChEMBL_454062 (CHEMBL903253)
IC50
214±n/a nM
Citation
 Wallace, DMHaramura, MCheng, JFArrhenius, TNadzan, AM Novel trifluoroacetophenone derivatives as malonyl-CoA decarboxylase inhibitors. Bioorg Med Chem Lett 17:1127-30 (2007)  
Target
Name:
Malonyl-CoA decarboxylase, mitochondrial
Synonyms:
DCMC_HUMAN Malonyl-CoA decarboxylase
Type:
PROTEIN
Mol. Mass.:
55018.37
Organism:
Homo sapiens (Human)
Description:
ChEMBL_665404
Residue:
493
  
Inhibitor
Name:
BDBM50202793
Synonyms:
CHEMBL246033 | N-(2-cyanoethyl)-N-ethyl-4-(2,2,2-trifluoroacetyl)benzamide
Type:
Small organic molecule
Emp. Form.:
C14H13F3N2O2
Mol. Mass.:
298.2604
SMILES:
CCN(CCC#N)C(=O)c1ccc(cc1)C(=O)C(F)(F)F
: