Target
Malonyl-CoA decarboxylase, mitochondrial
Ligand
BDBM50202811
Substrate
Meas. Tech.
ChEMBL_454062 (CHEMBL903253)
IC50
5011±n/a nM
Citation
 Wallace, DMHaramura, MCheng, JFArrhenius, TNadzan, AM Novel trifluoroacetophenone derivatives as malonyl-CoA decarboxylase inhibitors. Bioorg Med Chem Lett 17:1127-30 (2007)  
Target
Name:
Malonyl-CoA decarboxylase, mitochondrial
Synonyms:
DCMC_HUMAN Malonyl-CoA decarboxylase
Type:
PROTEIN
Mol. Mass.:
55018.37
Organism:
Homo sapiens (Human)
Description:
ChEMBL_665404
Residue:
493
  
Inhibitor
Name:
BDBM50202811
Synonyms:
CHEMBL396911 | N-(2-methoxyphenyl)-4-(2,2,2-trifluoroacetyl)benzamide
Type:
Small organic molecule
Emp. Form.:
C16H12F3NO3
Mol. Mass.:
323.2666
SMILES:
COc1ccccc1NC(=O)c1ccc(cc1)C(=O)C(F)(F)F
: