Target
Malonyl-CoA decarboxylase, mitochondrial
Ligand
BDBM50202817
Substrate
Meas. Tech.
ChEMBL_454062 (CHEMBL903253)
IC50
2800±n/a nM
Citation
 Wallace, DMHaramura, MCheng, JFArrhenius, TNadzan, AM Novel trifluoroacetophenone derivatives as malonyl-CoA decarboxylase inhibitors. Bioorg Med Chem Lett 17:1127-30 (2007)  
Target
Name:
Malonyl-CoA decarboxylase, mitochondrial
Synonyms:
DCMC_HUMAN Malonyl-CoA decarboxylase
Type:
PROTEIN
Mol. Mass.:
55018.37
Organism:
Homo sapiens (Human)
Description:
ChEMBL_665404
Residue:
493
  
Inhibitor
Name:
BDBM50202817
Synonyms:
1,1-diisobutyl-3-propyl-3-(4-(2,2,2-trifluoroacetyl)phenyl)urea | CHEMBL247055
Type:
Small organic molecule
Emp. Form.:
C20H29F3N2O2
Mol. Mass.:
386.4517
SMILES:
CCCN(C(=O)N(CC(C)C)CC(C)C)c1ccc(cc1)C(=O)C(F)(F)F
: