Target
Acetyl-CoA carboxylase 1
Ligand
BDBM50195048
Substrate
Meas. Tech.
ChEMBL_446847 (CHEMBL897146)
IC50
760±n/a nM
Citation
 Clark, RFZhang, TWang, XWang, RZhang, XCamp, HSBeutel, BASham, HLGu, YG Phenoxy thiazole derivatives as potent and selective acetyl-CoA carboxylase 2 inhibitors: Modulation of isozyme selectivity by incorporation of phenyl ring substituents. Bioorg Med Chem Lett 17:1961-5 (2007)  
Target
Name:
Acetyl-CoA carboxylase 1
Synonyms:
ACAC ACACA_HUMAN ACC1 Acetyl-CoA carboxylase 1 | Acetyl-CoA carboxylase 1 (ACC1)
Type:
Protein
Mol. Mass.:
265543.22
Organism:
Homo sapiens (Human)
Description:
Q13085
Residue:
2346
  
Inhibitor
Name:
BDBM50195048
Synonyms:
CHEMBL219665 | N-(4-(2-(4-((tetrahydrofuran-3-yl)methoxy)phenoxy)thiazol-5-yl)but-3-yn-2-yl)acetamide
Type:
Small organic molecule
Emp. Form.:
C20H22N2O4S
Mol. Mass.:
386.465
SMILES:
CC(NC(C)=O)C#Cc1cnc(Oc2ccc(OCC3CCOC3)cc2)s1
: