Target
Interstitial collagenase
Ligand
BDBM50204386
Substrate
Meas. Tech.
ChEMBL_447082 (CHEMBL897383)
IC50
>5000±n/a nM
Citation
 Chen, XTGhavimi, BCorbett, RLXue, CBLiu, RQCovington, MBQian, MVaddi, KGChrist, DDHartman, KDRibadeneira, MDTrzaskos, JMNewton, RCDecicco, CPDuan, JJ A new 4-(2-methylquinolin-4-ylmethyl)phenyl P1' group for the beta-amino hydroxamic acid derived TACE inhibitors. Bioorg Med Chem Lett 17:1865-70 (2007)  
Target
Name:
Interstitial collagenase
Synonyms:
CLG MMP1 Matrix metalloproteinase-1 | Matrix metalloproteinase-1 (MMP-1)
Type:
Enzyme
Mol. Mass.:
54010.26
Organism:
Homo sapiens (Human)
Description:
P03956
Residue:
469
  
Inhibitor
Name:
BDBM50204386
Synonyms:
(3S,4S)-methyl 3-(hydroxycarbamoyl)-4-(4-((2-methylquinolin-4-yl)methyl)benzamido)pyrrolidine-1-carboxylate | CHEMBL233844
Type:
Small organic molecule
Emp. Form.:
C25H26N4O5
Mol. Mass.:
462.4977
SMILES:
COC(=O)N1C[C@@H](NC(=O)c2ccc(Cc3cc(C)nc4ccccc34)cc2)[C@H](C1)C(=O)NO
: