Target
72 kDa type IV collagenase
Ligand
BDBM50204386
Substrate
Meas. Tech.
ChEMBL_447083 (CHEMBL897384)
IC50
>2000±n/a nM
Citation
 Chen, XTGhavimi, BCorbett, RLXue, CBLiu, RQCovington, MBQian, MVaddi, KGChrist, DDHartman, KDRibadeneira, MDTrzaskos, JMNewton, RCDecicco, CPDuan, JJ A new 4-(2-methylquinolin-4-ylmethyl)phenyl P1' group for the beta-amino hydroxamic acid derived TACE inhibitors. Bioorg Med Chem Lett 17:1865-70 (2007)  
Target
Name:
72 kDa type IV collagenase
Synonyms:
72 kDa gelatinase CLG4A Gelatinase A (MMP-2) MMP2_HUMAN Matrix metalloproteinase-2 (MMP 2) Matrix metalloproteinases 2 (MMP-2) | TBE-1
Type:
Enzyme
Mol. Mass.:
73870.36
Organism:
Homo sapiens (Human)
Description:
P08253
Residue:
660
  
Inhibitor
Name:
BDBM50204386
Synonyms:
(3S,4S)-methyl 3-(hydroxycarbamoyl)-4-(4-((2-methylquinolin-4-yl)methyl)benzamido)pyrrolidine-1-carboxylate | CHEMBL233844
Type:
Small organic molecule
Emp. Form.:
C25H26N4O5
Mol. Mass.:
462.4977
SMILES:
COC(=O)N1C[C@@H](NC(=O)c2ccc(Cc3cc(C)nc4ccccc34)cc2)[C@H](C1)C(=O)NO
: