Target
Glutamate receptor ionotropic, NMDA 2B
Ligand
BDBM50204876
Substrate
Meas. Tech.
ChEMBL_428114 (CHEMBL914283)
IC50
596±n/a nM
Citation
 Borza, IBozó, EBarta-Szalai, GKiss, CTárkányi, GDemeter, AGáti, THáda, VKolok, SGere, AFodor, LNagy, JGalgóczy, KMagdó, IAgai, BFetter, JBertha, FKeserü, GMHorváth, CFarkas, SGreiner, IDomány, G Selective NR1/2B N-methyl-D-aspartate receptor antagonists among indole-2-carboxamides and benzimidazole-2-carboxamides. J Med Chem 50:901-14 (2007)  
Target
Name:
Glutamate receptor ionotropic, NMDA 2B
Synonyms:
GluN2B Grin2b NMDA receptor subunit N2B (GluN2B) NMDE2_RAT | NR2B
Type:
Protein
Mol. Mass.:
166077.66
Organism:
Rattus norvegicus (Rat)
Description:
Q00960
Residue:
1482
  
Inhibitor
Name:
BDBM50204876
Synonyms:
(5-amino-1H-indol-2-yl)-(4-benzyl-piperidin-1-yl)-methanone | CHEMBL375805
Type:
Small organic molecule
Emp. Form.:
C21H23N3O
Mol. Mass.:
333.4268
SMILES:
Nc1ccc2[nH]c(cc2c1)C(=O)N1CCC(Cc2ccccc2)CC1
: