Target
Dipeptidyl peptidase 4
Ligand
BDBM50205211
Substrate
Meas. Tech.
ChEMBL_442256 (CHEMBL892415)
IC50
6.5±n/a nM
Citation
 Kondo, TNekado, TSugimoto, IOchi, KTakai, SKinoshita, ATajima, YYamamoto, SKawabata, KNakai, HToda, M Design and synthesis of new potent dipeptidyl peptidase IV inhibitors with enhanced ex vivo duration. Bioorg Med Chem 15:2631-50 (2007)  
Target
Name:
Dipeptidyl peptidase 4
Synonyms:
ADABP Adenosine deaminase complexing protein 2 CD_antigen=CD26 DPP4 DPPIV Dipeptidyl peptidase 4 (DPP IV) Dipeptidyl peptidase 4 (DPP4) Dipeptidyl peptidase 4 membrane form Dipeptidyl peptidase IV Dipeptidyl peptidase IV (DDP-IV) Dipeptidyl peptidase IV membrane form Dipeptidyl peptidase-IV (DPP-4) T-cell activation antigen CD26 | TP103
Type:
Enzyme
Mol. Mass.:
88271.01
Organism:
Homo sapiens (Human)
Description:
P27487
Residue:
766
  
Inhibitor
Name:
BDBM50205211
Synonyms:
(2S)-1-{[(2S,4S,5S)-5-Methyl-4-(1-pyrrolidinylcarbonyl)-2-pyrrolidinyl]carbonyl}-2-pyrrolidinecarbonitrile | CHEMBL393957
Type:
Small organic molecule
Emp. Form.:
C16H24N4O2
Mol. Mass.:
304.3874
SMILES:
C[C@@H]1N[C@@H](C[C@@H]1C(=O)N1CCCC1)C(=O)N1CCC[C@H]1C#N
: