Target
5-hydroxytryptamine receptor 7
Ligand
BDBM50206165
Substrate
Meas. Tech.
ChEMBL_454683 (CHEMBL886703)
Ki
400±n/a nM
Citation
 Suckling, CJMurphy, JAKhalaf, AIZhou, SZLizos, DEvan Nhien, ANYasumatsu, HMcVie, AYoung, LCMcCraw, CWaterman, PGMorris, BJPratt, JAHarvey, AL M4 agonists/5HT7 antagonists with potential as antischizophrenic drugs: serominic compounds. Bioorg Med Chem Lett 17:2649-55 (2007)  
Target
Name:
5-hydroxytryptamine receptor 7
Synonyms:
5-HT-7 5-HT7 5-HT7S 5HT7 HTR7 | Serotonin receptor 7
Type:
G Protein-Coupled Receptor (GPCR)
Mol. Mass.:
53573.08
Organism:
Homo sapiens (Human)
Description:
P34969
Residue:
479
  
Inhibitor
Name:
BDBM50206165
Synonyms:
(E)-7-((6,7-dimethoxy-3,4-dihydroisoquinolin-2(1H)-yl)methyleneamino)-1,2,3,4-tetrahydronaphthalen-1-yl acetate | CHEMBL240022
Type:
Small organic molecule
Emp. Form.:
C24H28N2O4
Mol. Mass.:
408.4901
SMILES:
COc1cc2CCN(Cc2cc1OC)\C=N\c1ccc2CCCC(OC(C)=O)c2c1
: