Target
D(2) dopamine receptor
Ligand
BDBM50206172
Substrate
Meas. Tech.
ChEMBL_454685 (CHEMBL886705)
Ki
4600±n/a nM
Citation
 Suckling, CJMurphy, JAKhalaf, AIZhou, SZLizos, DEvan Nhien, ANYasumatsu, HMcVie, AYoung, LCMcCraw, CWaterman, PGMorris, BJPratt, JAHarvey, AL M4 agonists/5HT7 antagonists with potential as antischizophrenic drugs: serominic compounds. Bioorg Med Chem Lett 17:2649-55 (2007)  
Target
Name:
D(2) dopamine receptor
Synonyms:
D(2) dopamine receptor DOPAMINE D2 Long DRD2 Dopamine D2 receptor Dopamine D2 receptor (D2R) Dopamine2-like | d2
Type:
Cell-surface receptors
Mol. Mass.:
50647.10
Organism:
Homo sapiens (Human)
Description:
P14416
Residue:
443
  
Inhibitor
Name:
BDBM50206172
Synonyms:
1-(benzo[d][1,3]dioxol-5-ylmethyl)-2,3,4,9-tetrahydro-1H-pyrido[3,4-b]indole CHEMBL328476
Type:
Small organic molecule
Emp. Form.:
C19H18N2O2
Mol. Mass.:
306.3584
SMILES:
C(C1NCCc2c1[nH]c1ccccc21)c1ccc2OCOc2c1
: