Target
D(2) dopamine receptor
Ligand
BDBM50206178
Substrate
Meas. Tech.
ChEMBL_454685 (CHEMBL886705)
Ki
1700±n/a nM
Citation
 Suckling, CJMurphy, JAKhalaf, AIZhou, SZLizos, DEvan Nhien, ANYasumatsu, HMcVie, AYoung, LCMcCraw, CWaterman, PGMorris, BJPratt, JAHarvey, AL M4 agonists/5HT7 antagonists with potential as antischizophrenic drugs: serominic compounds. Bioorg Med Chem Lett 17:2649-55 (2007)  
Target
Name:
D(2) dopamine receptor
Synonyms:
D(2) dopamine receptor DOPAMINE D2 Long DRD2 Dopamine D2 receptor Dopamine D2 receptor (D2R) Dopamine2-like | d2
Type:
Cell-surface receptors
Mol. Mass.:
50647.10
Organism:
Homo sapiens (Human)
Description:
P14416
Residue:
443
  
Inhibitor
Name:
BDBM50206178
Synonyms:
(E)-6-((3,4-dihydroisoquinolin-2(1H)-yl)methyleneamino)-2,3-dihydro-1H-inden-1-yl acetate | CHEMBL241103
Type:
Small organic molecule
Emp. Form.:
C21H22N2O2
Mol. Mass.:
334.4116
SMILES:
CC(=O)OC1CCc2ccc(cc12)\N=C\N1CCc2ccccc2C1
: