Target
5-hydroxytryptamine receptor 7
Ligand
BDBM50206169
Substrate
Meas. Tech.
ChEMBL_454683 (CHEMBL886703)
Ki
36±n/a nM
Citation
 Suckling, CJMurphy, JAKhalaf, AIZhou, SZLizos, DEvan Nhien, ANYasumatsu, HMcVie, AYoung, LCMcCraw, CWaterman, PGMorris, BJPratt, JAHarvey, AL M4 agonists/5HT7 antagonists with potential as antischizophrenic drugs: serominic compounds. Bioorg Med Chem Lett 17:2649-55 (2007)  
Target
Name:
5-hydroxytryptamine receptor 7
Synonyms:
5-HT-7 5-HT7 5-HT7S 5HT7 HTR7 | Serotonin receptor 7
Type:
G Protein-Coupled Receptor (GPCR)
Mol. Mass.:
53573.08
Organism:
Homo sapiens (Human)
Description:
P34969
Residue:
479
  
Inhibitor
Name:
BDBM50206169
Synonyms:
1-(benzo[d][1,3]dioxol-5-ylmethyl)-6-methoxy-2,3,4,9-tetrahydro-1H-pyrido[3,4-b]indole | CHEMBL391190
Type:
Small organic molecule
Emp. Form.:
C20H20N2O3
Mol. Mass.:
336.3844
SMILES:
COc1ccc2[nH]c3C(Cc4ccc5OCOc5c4)NCCc3c2c1
: