Target
Muscarinic acetylcholine receptor M4
Ligand
BDBM50206184
Substrate
Meas. Tech.
ChEMBL_454684 (CHEMBL886704)
Ki
700±n/a nM
Citation
 Suckling, CJMurphy, JAKhalaf, AIZhou, SZLizos, DEvan Nhien, ANYasumatsu, HMcVie, AYoung, LCMcCraw, CWaterman, PGMorris, BJPratt, JAHarvey, AL M4 agonists/5HT7 antagonists with potential as antischizophrenic drugs: serominic compounds. Bioorg Med Chem Lett 17:2649-55 (2007)  
Target
Name:
Muscarinic acetylcholine receptor M4
Synonyms:
ACM4_HUMAN Cholinergic, muscarinic M4 Muscarinic acetylcholine receptor M2 and M4
Type:
Enzyme Catalytic Domain
Mol. Mass.:
53079.31
Organism:
Homo sapiens (Human)
Description:
Cholinergic, muscarinic M4 CHRM4 HUMAN M3::P08173
Residue:
479
  
Inhibitor
Name:
BDBM50206184
Synonyms:
(E)-N-((6,7-dimethoxy-3,4-dihydroisoquinolin-2(1H)-yl)methylene)-2,3,4a,5,6,10b-hexahydronaphtho[1,2-b][1,4]dithiin-9-amine | CHEMBL241282
Type:
Small organic molecule
Emp. Form.:
C24H28N2O2S2
Mol. Mass.:
440.621
SMILES:
COc1cc2CCN(Cc2cc1OC)\C=N\c1ccc2CCC3SCCSC3c2c1
: