Target
5-hydroxytryptamine receptor 7
Ligand
BDBM50206167
Substrate
Meas. Tech.
ChEMBL_454683 (CHEMBL886703)
Ki
3600±n/a nM
Citation
 Suckling, CJMurphy, JAKhalaf, AIZhou, SZLizos, DEvan Nhien, ANYasumatsu, HMcVie, AYoung, LCMcCraw, CWaterman, PGMorris, BJPratt, JAHarvey, AL M4 agonists/5HT7 antagonists with potential as antischizophrenic drugs: serominic compounds. Bioorg Med Chem Lett 17:2649-55 (2007)  
Target
Name:
5-hydroxytryptamine receptor 7
Synonyms:
5-HT-7 5-HT7 5-HT7S 5HT7 HTR7 | Serotonin receptor 7
Type:
G Protein-Coupled Receptor (GPCR)
Mol. Mass.:
53573.08
Organism:
Homo sapiens (Human)
Description:
P34969
Residue:
479
  
Inhibitor
Name:
BDBM50206167
Synonyms:
(E)-N-benzyl-N'-(3-hydroxy-2,3-dihydro-1H-inden-5-yl)-N-methylformamidine | CHEMBL392888
Type:
Small organic molecule
Emp. Form.:
C18H20N2O
Mol. Mass.:
280.3642
SMILES:
CN(Cc1ccccc1)\C=N\c1ccc2CCC(O)c2c1
: