Target
Cytosolic phospholipase A2
Ligand
BDBM50206339
Substrate
Meas. Tech.
ChEMBL_442619 (CHEMBL892787)
IC50
500±n/a nM
Citation
 Hess, MSchulze Elfringhoff, ALehr, M 1-(5-Carboxy- and 5-carbamoylindol-1-yl)propan-2-ones as inhibitors of human cytosolic phospholipase A2alpha: bioisosteric replacement of the carboxylic acid and carboxamide moiety. Bioorg Med Chem 15:2883-91 (2007)  
Target
Name:
Cytosolic phospholipase A2
Synonyms:
CPLA2 PA24A_HUMAN PLA2G4A Phospholipase A2 | Phospholipase A2 group IVA
Type:
Protein
Mol. Mass.:
85219.30
Organism:
Homo sapiens (Human)
Description:
P47712
Residue:
749
  
Inhibitor
Name:
BDBM50206339
Synonyms:
1-[5-(morpholine-4-carbonyl)indol-1-yl]-3-(4-octylphenoxy)propan-2-one | CHEMBL428391
Type:
Small organic molecule
Emp. Form.:
C30H38N2O4
Mol. Mass.:
490.6337
SMILES:
CCCCCCCCc1ccc(OCC(=O)Cn2ccc3cc(ccc23)C(=O)N2CCOCC2)cc1
: